{"text_format":"1","workbook":"xlsx","n_sheets":5,"sheets":["STARTシート","新規登録シート","データベース","DDリスト","WIN_印刷用_カードサイズパウチ用"],"not_rendered":{"charts":0,"images":0,"macros":1,"external_links":0,"defined_names":2,"comments":0,"pivot_tables":0},"unopened":[],"bounds":{"document_bytes":16777216,"sheet_cells":100000,"rows_first":2000,"rows_last":500,"rows_between":2000,"halvings":0,"cell_chars":16384,"cell_head_chars":4096},"cells_cut":0,"cells_raw":0,"read":"whole","date_system":"1900"}

{"sheet":"STARTシート","index":0,"n_rows":6,"n_cols":3,"rows_kept":6,"cut":false,"hidden":false,"merged":[[1,0,1,2]]}
[null,null,"ver1.0"]
["「輸血関連情報カード」発行アプリ"]
[]
[null,null,"【施設情報入力欄】"]
[null,"施設名：","架空大学附属北部病院医療センター"]
[null,"連絡先(TEL)：","00-0000-0000 (内線:0000)"]

{"sheet":"新規登録シート","index":1,"n_rows":31,"n_cols":8,"rows_kept":31,"cut":false,"hidden":false,"merged":[[2,2,2,3],[27,2,27,3],[28,2,28,3],[29,2,29,3],[10,2,10,3],[11,2,11,3],[12,2,12,3],[13,2,13,3],[14,2,14,3],[15,2,15,3],[3,2,3,3],[4,2,4,3],[5,2,5,3],[6,2,6,3],[7,2,7,3],[8,2,8,3],[9,2,9,3],[30,2,30,3],[25,2,25,3],[19,2,19,3],[18,2,18,3],[21,2,21,3],[23,2,23,3],[24,2,24,3],[26,2,26,3]]}
[null,"新規登録フォーム"]
[]
[null,"基本情報↓","入力欄",null,"入力例 等",null,null,"←背景ピンクは、自由記述式"]
[null,"DB登録日",null,null,"ex：2016/1/1",null,null,"←背景ブルーは、リスト選択式"]
[null,"患者ID",null,null,"※カードには印字されません"]
[null,"フリガナ",null,null,"ex：フキソク コウタイ"]
[null,"氏名",null,null,"ex：不規則 抗体"]
[null,"生年月日",null,null,"ex：2016/1/1"]
[null,"性別",null,null,"選択"]
[null,"不規則抗体情報↓"]
[null,"抗体1",null,null,"選択"]
[null,"抗体1検出日",null,null,"ex：2016/1/1"]
[null,"抗体2",null,null,"選択"]
[null,"抗体2検出日",null,null,"ex：2016/1/1"]
[null,"抗体3",null,null,"選択"]
[null,"抗体3検出日",null,null,"ex：2016/1/1"]
[null,"抗体4",null,null,"選択"]
[null,"抗体4検出日",null,null,"ex：2016/1/1"]
[null,"抗体コメント",null,null,"備考欄　約50文字"]
[null,"移植歴情報↓","※無ければ未記入で"]
[null,"患者血液型",null,null,"選択　ABO型　Rh型"]
[null,"移植臓器",null,null,"選択"]
[null,"ドナー血液型",null,null,"選択　ABO型　Rh型"]
[null,"移植日",null,null,"ex：2016/1/1"]
[null,"移植・その他コメント",null,null,"備考欄　約170文字まで"]
[null,"投薬情報↓","※無ければ未記入で"]
[null,"薬剤1",null,null,"フリー入力欄"]
[null,"薬剤1開始日",null,null,"ex：2016/1/1"]
[null,"薬剤2",null,null,"フリー入力欄"]
[null,"薬剤2開始日",null,null,"ex：2016/1/1"]
[null,"薬剤コメント",null,null,"備考欄　約70文字まで"]

{"sheet":"データベース","index":2,"n_rows":6,"n_cols":31,"rows_kept":6,"cut":false,"hidden":false,"merged":[]}
["　　・入力内容を確認し、修正する場合はこのシート上で内容を書き換えてください。"]
["　　・印刷したいＮｏ．を下の緑色のセルに入力し「印刷画面へ」ボタン押すと印刷シートへ遷移します。"]
["***","印刷No.","例）"]
["***"]
["index","DB登録日","p-id","フリガナ","氏名","生年月日","性別",null,"抗体1","抗体1検出日","抗体2","抗体2検出日","抗体3","抗体3検出日","抗体4","抗体4検出日","抗体フリーコメント",null,"患者ABO血液型","患者RhD血液型","移植臓器","ドナーABO血液型","ドナーRhD血液型","移植日","移植フリーコメント",null,"薬剤1","薬剤1開始日","薬剤2","薬剤2開始日","薬剤フリーコメント"]
["例）","2016-12-31",0,"ユケツ　タロウ","輸血　太郎","1984-10-30","男性",null,"抗C","1999-11-11","抗e","2016-12-31",null,null,"抗Dia","2016-06-04","ここには不規則抗体情報に関するコメントを入力できます。",null,"ＡＢ型","Ｒｈ＋","腎臓","ＡＢ型","Ｒｈ－","2010-04-01","ここには移植歴情報および、その他のコメントを入力出来ます。",null,"ヤクザイメイ","2014-08-09","ﾔｸｻﾞｲﾒｲﾔｸｻﾞｲﾒｲ","2014-08-09","ここには薬剤歴情報に関するコメントを入力できます。"]

{"sheet":"DDリスト","index":3,"n_rows":45,"n_cols":8,"rows_kept":45,"cut":false,"hidden":false,"merged":[]}
[null,null,null,null,null,null,null,"作成：齋藤光平"]
["・項目の追加・変更は太枠線内において編集可能です。"]
[]
["性別",null,"抗体種類",null,"臓器名",null,"血液型","Rh型"]
[null,0,null,0]
["男性",1,"抗C",1,"腎臓",null,"Ａ型","Ｒｈ＋"]
["女性",2,"抗c",2,"造血幹細胞",null,"Ｏ型","Ｒｈ−"]
[null,3,"抗D",3,"肝臓",null,"Ｂ型","その他"]
[null,4,"抗E",4,"その他",null,"ＡＢ型","保留"]
[null,5,"抗e",5,null,null,"Ａ亜"]
[null,6,"抗K",6,null,null,"Ｂ亜"]
[null,7,"抗k",7,null,null,"ＡＢ亜"]
[null,8,"抗Fya",8,null,null,"その他"]
[null,9,"抗Fyb",9,null,null,"保留"]
[null,10,"抗Jka",null,null,null,"※標準化マスタ準拠"]
[null,11,"抗Jkb"]
[null,12,"抗S"]
[null,13,"抗s"]
[null,14,"抗Dia"]
[null,15,"抗Dib"]
[null,16,"抗Jra"]
[null,17,"抗Lea"]
[null,18,"抗M"]
[null,19,"自己抗体"]
[null,20,"同定不能"]
[null,21]
[null,22]
[null,23]
[null,24]
[null,25]
[null,26]
[null,27]
[null,28]
[null,29]
[null,30]
[null,31]
[null,32]
[null,33]
[null,34]
[null,35]
[null,36]
[null,37]
[null,38]
[null,39]
[null,40]

{"sheet":"WIN_印刷用_カードサイズパウチ用","index":4,"n_rows":49,"n_cols":10,"rows_kept":49,"cut":false,"hidden":false,"merged":[[3,11,6,19],[8,11,9,19],[10,0,11,3],[10,11,11,19],[12,5,16,9],[13,0,13,3],[14,0,14,3],[15,0,16,3]]}
[]
[null,null,null,null,null,null,null,null,null,{"$f":"STARTシート!C5","v":"架空大学附属北部病院医療センター"}]
[]
[]
[]
[]
[]
[]
[]
[]
[]
[]
[]
[]
[]
[]
[]
[]
[]
[]
[]
[]
[]
[]
["呼び出しデータ一時表示エリア"]
[{"$f":"\"最終登録日：\"&TEXT(VLOOKUP(データベース!$C$3,データベース!$6:$976,2,0),\"yyyy/mm/dd\")&\"　No. \"&VLOOKUP(データベース!$C$3,データベース!$6:$976,1,0)","v":"最終登録日：2016/12/31　No. 例）"}]
[{"$f":"VLOOKUP(データベース!$C$3,データベース!$6:$976,4,0)","v":"ユケツ　タロウ"}]
[{"$f":"VLOOKUP(データベース!$C$3,データベース!$6:$976,5,0)","v":"輸血　太郎"}]
[{"$f":"VLOOKUP(データベース!$C$3,データベース!$6:$976,7,0)","v":"男性"}]
[{"$f":"VLOOKUP(データベース!$C$3,データベース!$6:$976,6,0)","v":"1984-10-30"}]
[{"$f":"IF(ISBLANK(VLOOKUP(データベース!$C$3,データベース!$6:$976,9,0)),\"　なし\",VLOOKUP(データベース!$C$3,データベース!$6:$976,9,0))","v":"抗C"},null,{"$f":"\"- 検出日：\"&IF(ISBLANK(VLOOKUP(データベース!$C$3,データベース!$6:$976,10,0)),\" - \",TEXT(VLOOKUP(データベース!$C$3,データベース!$6:$976,10,0),\"yyyy/mm/dd\"))","v":"- 検出日：1999/11/11"}]
[{"$f":"IF(ISBLANK(VLOOKUP(データベース!$C$3,データベース!$6:$976,11,0)),\"-\",VLOOKUP(データベース!$C$3,データベース!$6:$976,11,0))","v":"抗e"},null,{"$f":"\"- 検出日：\"&IF(ISBLANK(VLOOKUP(データベース!$C$3,データベース!$6:$976,12,0)),\" - \",TEXT(VLOOKUP(データベース!$C$3,データベース!$6:$976,12,0),\"yyyy/mm/dd\"))","v":"- 検出日：2016/12/31"}]
[{"$f":"IF(ISBLANK(VLOOKUP(データベース!$C$3,データベース!$6:$976,13,0)),\"-\",VLOOKUP(データベース!$C$3,データベース!$6:$976,13,0))","v":"-"},null,{"$f":"\"- 検出日：\"&IF(ISBLANK(VLOOKUP(データベース!$C$3,データベース!$6:$976,14,0)),\" - \",TEXT(VLOOKUP(データベース!$C$3,データベース!$6:$976,14,0),\"yyyy/mm/dd\"))","v":"- 検出日： - "}]
[{"$f":"IF(ISBLANK(VLOOKUP(データベース!$C$3,データベース!$6:$976,17,0)),\"備考欄：-\",\"備考欄：\"&VLOOKUP(データベース!$C$3,データベース!$6:$976,17,0))","v":"備考欄：ここには不規則抗体情報に関するコメントを入力できます。"}]
[]
[{"$f":"IF(ISBLANK(VLOOKUP(データベース!$C$3,データベース!$6:$976,21,0)),\"なし\",\"移植日：\"&TEXT(VLOOKUP(データベース!$C$3,データベース!$6:$976,24,0),\"yyyy/mm/dd\"))","v":"移植日：2010/04/01"}]
[{"$f":"IF(ISBLANK(VLOOKUP(データベース!$C$3,データベース!$6:$976,19,0)),\"情報なし\",\"患者血液型：\"&VLOOKUP(データベース!$C$3,データベース!$6:$976,19,0)&\" \"&VLOOKUP(データベース!$C$3,データベース!$6:$976,20,0))","v":"患者血液型：ＡＢ型 Ｒｈ＋"}]
[{"$f":"IF(ISBLANK(VLOOKUP(データベース!$C$3,データベース!$6:$976,21,0)),\"\",\"[移植情報]\")","v":"[移植情報]"}]
[{"$f":"IF(ISBLANK(VLOOKUP(データベース!$C$3,データベース!$6:$976,21,0)),\"\",VLOOKUP(データベース!$C$3,データベース!$6:$976,21,0)&\" 移植\")","v":"腎臓 移植"}]
[{"$f":"IF(ISBLANK(VLOOKUP(データベース!$C$3,データベース!$6:$976,21,0)),\"\",\"ドナー血液型：\"&VLOOKUP(データベース!$C$3,データベース!$6:$976,22,0)&\" \"&VLOOKUP(データベース!$C$3,データベース!$6:$976,23,0))","v":"ドナー血液型：ＡＢ型 Ｒｈ－"}]
[{"$f":"IF(ISBLANK(VLOOKUP(データベース!$C$3,データベース!$6:$976,25,0)),\"備考欄：-\",\"備考欄：\"&VLOOKUP(データベース!$C$3,データベース!$6:$976,25,0))","v":"備考欄：ここには移植歴情報および、その他のコメントを入力出来ます。"}]
[]
[{"$f":"IF(ISBLANK(VLOOKUP(データベース!$C$3,データベース!$6:$976,27,0)),\"　なし\",VLOOKUP(データベース!$C$3,データベース!$6:$976,27,0))","v":"ヤクザイメイ"},null,{"$f":"IF(ISBLANK(VLOOKUP(データベース!$C$3,データベース!$6:$976,28,0)),\"開始： -\",\"開始：\"&TEXT(VLOOKUP(データベース!$C$3,データベース!$6:$976,28,0),\"yyyy/mm/dd\"))","v":"開始：2014/08/09"}]
[{"$f":"IF(ISBLANK(VLOOKUP(データベース!$C$3,データベース!$6:$976,29,0)),\" -\",VLOOKUP(データベース!$C$3,データベース!$6:$976,29,0))","v":"ﾔｸｻﾞｲﾒｲﾔｸｻﾞｲﾒｲ"},null,{"$f":"IF(ISBLANK(VLOOKUP(データベース!$C$3,データベース!$6:$976,30,0)),\"開始： -\",\"開始：\"&TEXT(VLOOKUP(データベース!$C$3,データベース!$6:$976,30,0),\"yyyy/mm/dd\"))","v":"開始：2014/08/09"}]
[{"$f":"IF(ISBLANK(VLOOKUP(データベース!$C$3,データベース!$6:$976,31,0)),\"備考欄：-\",\"備考欄：\"&VLOOKUP(データベース!$C$3,データベース!$6:$976,31,0))","v":"備考欄：ここには薬剤歴情報に関するコメントを入力できます。"}]
[]
[{"$f":"\"発行施設名：\"&STARTシート!C5","v":"発行施設名：架空大学附属北部病院医療センター"}]
[{"$f":"\"　　連絡先：\"&STARTシート!C6","v":"　　連絡先：00-0000-0000 (内線:0000)"}]
[{"$f":"STARTシート!C5&\" 発行\"","v":"架空大学附属北部病院医療センター 発行"},null,null,null,null,"■"]